Altmetric Attention Score,Title,Journal/Collection Title,Authors at my Institution,Departments,Output Type,Publication Date,DOI,ISBN,National Clinical Trial ID,URI,PubMed ID,PubMedCentral ID,Handle.net ID,ADS Bibcode,arXiv ID,RePEc ID,SSRN,Number of news stories,Number of blog posts,Number of policy documents,Number of tweets,Number of peer reviews,Number of weibo posts,Number of Facebook posts,Number of Wikipedia pages,Number of Google+ posts,Number of LinkedIn posts,Number of Reddit posts,Number of pins,Number of Research highlight platforms,Number of Q&A threads,Number of videos,Number of Mendeley readers,Details Page URL,Badge URL
2447,"10-Year Outcomes after Monitoring, Surgery, or Radiotherapy for Localized Prostate Cancer",New England Journal of Medicine,,,Article,2016-09-14,10.1056/nejmoa1606220,,,,27626136,,,,,,,289,17,0,637,0,0,17,0,7,0,2,0,2,0,0,304,https://www.altmetric.com/details/12003554,https://api.altmetric.com/v1/donut/12003554_240.png
1171,Inherited DNA-Repair Gene Mutations in Men with Metastatic Prostate Cancer,New England Journal of Medicine,,,Article,2016-07-06,10.1056/nejmoa1603144,,,,27433846,,,,,,,129,4,0,444,0,0,9,0,1,0,1,0,0,0,0,59,https://www.altmetric.com/details/9282970,https://api.altmetric.com/v1/donut/9282970_240.png
738,Sexual factors and prostate cancer,British Journal of Urology,,,Article,2003-07-23,10.1046/j.1464-410x.2003.04319.x,,,,12887469,,,,,,,1,5,0,767,0,0,80,4,12,0,9,0,0,1,3,79,https://www.altmetric.com/details/425010,https://api.altmetric.com/v1/donut/425010_240.png
649,Effect of comprehensive lifestyle changes on telomerase activity and telomere length in men with biopsy-proven low-risk prostate cancer: 5-year follow-up of a descriptive pilot study,Lancet Oncology,,,Article,2013-01-01,10.1016/s1470-2045(13)70366-8,,,,24051140,,,,,,,69,6,0,132,0,0,87,1,12,0,2,0,0,0,0,177,https://www.altmetric.com/details/1753675,https://api.altmetric.com/v1/donut/1753675_240.png
633,Association of AR-V7 on Circulating Tumor Cells as a Treatment-Specific Biomarker With Outcomes and Survival in Castration-Resistant Prostate Cancer,JAMA Oncology,,,Article,2016-06-04,10.1001/jamaoncol.2016.1828,,,,27262168,,,,,,,138,1,0,62,0,0,0,0,0,0,0,0,0,0,0,29,https://www.altmetric.com/details/8478110,https://api.altmetric.com/v1/donut/8478110_240.png
622,Increasing incidence of metastatic prostate cancer in the United States (2004�2013),Prostate Cancer & Prostatic Diseases,,,Article,2016-07-19,10.1038/pcan.2016.30,,,,27431496,,,,,,,91,4,0,12,0,0,0,0,0,0,0,0,0,0,0,18,https://www.altmetric.com/details/9850895,https://api.altmetric.com/v1/donut/9850895_240.png
604,Trends in Metastatic Breast and Prostate Cancer--Lessons in Cancer Dynamics.,New England Journal of Medicine,,,Article,2015-10-29,10.1056/nejmp1510443,,,,26510017,,,,,,,24,11,0,597,1,0,22,1,5,0,3,0,0,0,0,5,https://www.altmetric.com/details/4700036,https://api.altmetric.com/v1/donut/4700036_240.png
566,Nut consumption and prostate cancer risk and mortality,British Journal of Cancer,,,Article,2016-06-09,10.1038/bjc.2016.181,,,,27280637,,,,,,,71,0,0,14,0,0,12,0,0,0,0,0,0,0,0,6,https://www.altmetric.com/details/8761160,https://api.altmetric.com/v1/donut/8761160_240.png
533,Vitamin E and the Risk of Prostate Cancer: The Selenium and Vitamin E Cancer Prevention Trial (SELECT),JAMA: Journal of the American Medical Association,,,Article,2011-10-12,10.1001/jama.2011.1437,,,,21990298,,,,,,,35,32,0,188,0,0,25,1,5,0,0,0,1,2,1,53,https://www.altmetric.com/details/399609,https://api.altmetric.com/v1/donut/399609_240.png
523,Recommendations on screening for prostate cancer with the prostate-specific antigen test,Canadian Medical Association Journal,,,Article,2014-11-04,10.1503/cmaj.140703,,,,25349003,,,,,,,35,1,0,379,0,0,15,0,3,0,0,0,0,0,0,14,https://www.altmetric.com/details/2812284,https://api.altmetric.com/v1/donut/2812284_240.png
500,Current Status of Prostate Cancer Diagnosis and Management in the United States,JAMA Oncology,,,Article,2016-06-23,10.1001/jamaoncol.2016.1785,,,,27356204,,,,,,,61,0,0,40,0,0,2,0,2,0,0,0,0,0,0,1,https://www.altmetric.com/details/8999914,https://api.altmetric.com/v1/donut/8999914_240.png
469,Ejaculation Frequency and Risk of Prostate Cancer: Updated Results with an Additional Decade of Follow-up,European Urology,,,Article,2016-03-29,10.1016/j.eururo.2016.03.027,,,,27033442,,,,,,,25,2,0,368,0,0,30,0,5,0,0,0,0,0,0,28,https://www.altmetric.com/details/6368624,https://api.altmetric.com/v1/donut/6368624_240.png
467,"Development and validation of a 24-gene predictor of response to postoperative radiotherapy in prostate cancer: a matched, retrospective analysis",Lancet Oncology,,,Article,2016-10-01,10.1016/s1470-2045(16)30491-0,,,,27743920,,,,,,,60,1,0,8,0,0,0,0,0,0,0,0,0,0,0,0,https://www.altmetric.com/details/12618486,https://api.altmetric.com/v1/donut/12618486_240.png
451,"Clinicopathological, functional, and immediate oncologic outcome assessment in men aged?50 years with prostate cancer after robotic prostatectomy",Urologic Oncology,,,Article,2016-08-24,10.1016/j.urolonc.2016.07.016,,,,27567690,,,,,,,57,0,0,2,0,0,0,0,0,0,0,0,0,0,0,8,https://www.altmetric.com/details/11676914,https://api.altmetric.com/v1/donut/11676914_240.png
450,Radical prostatectomy versus observation for localized prostate cancer.,New England Journal of Medicine,,,Article,2012-07-19,10.1056/nejmoa1113162,,,,22808955,,,,,,,11,20,6,366,0,0,11,1,3,0,1,0,3,0,0,127,https://www.altmetric.com/details/846235,https://api.altmetric.com/v1/donut/846235_240.png
443,"Dairy products, calcium, and prostate cancer risk: a systematic review and meta-analysis of cohort studies.",American Journal of Clinical Nutrition,,,Article,2015-01-15,10.3945/ajcn.113.067157,,,,25527754,,,,,,,6,3,0,120,0,0,48,0,422,0,0,0,0,0,0,1,https://www.altmetric.com/details/2907287,https://api.altmetric.com/v1/donut/2907287_240.png
441,"Patient-Reported Outcomes after Monitoring, Surgery, or Radiotherapy for Prostate Cancer",New England Journal of Medicine,,,Article,2016-09-14,10.1056/nejmoa1606221,,,,27626365,,,,,,,49,5,0,160,0,0,5,0,2,0,0,0,0,0,0,0,https://www.altmetric.com/details/12003565,https://api.altmetric.com/v1/donut/12003565_240.png
433,Plasma Phospholipid Fatty Acids and Prostate Cancer Risk in the SELECT Trial,JNCI: Journal of the National Cancer Institute,,,Article,2013-01-01,10.1093/jnci/djt174,,,,23843441,,,,,,,36,6,2,172,0,0,70,1,5,0,1,0,0,1,2,116,https://www.altmetric.com/details/1615930,https://api.altmetric.com/v1/donut/1615930_240.png
425,DNA-Repair Defects and Olaparib in Metastatic Prostate Cancer.,New England Journal of Medicine,,,Article,2015-10-29,10.1056/nejmoa1506859,,,,26510020,,,,,,,36,7,0,262,0,0,15,0,3,0,2,0,1,0,0,234,https://www.altmetric.com/details/4700077,https://api.altmetric.com/v1/donut/4700077_240.png
411,Comparison of MR/Ultrasound Fusion�Guided Biopsy With Ultrasound-Guided Biopsy for the Diagnosis of Prostate Cancer,JAMA: Journal of the American Medical Association,,,Article,2015-01-27,10.1001/jama.2014.17942,,,,25626035,,,,,,,43,6,0,197,0,0,10,0,0,0,0,0,2,0,1,161,https://www.altmetric.com/details/3108917,https://api.altmetric.com/v1/donut/3108917_240.png
399,"Sexual partners, sexually transmitted infections, and prostate cancer risk",Cancer Epidemiology,,,Article,2014-12-01,10.1016/j.canep.2014.09.005,,,,25277695,,,,,,,44,6,0,62,0,2,5,0,0,0,0,0,0,0,0,18,https://www.altmetric.com/details/2820648,https://api.altmetric.com/v1/donut/2820648_240.png
380,Vasectomy and Risk of Aggressive Prostate Cancer: A 24-Year Follow-Up Study,Journal of Clinical Oncology,,,Article,2014-07-06,10.1200/jco.2013.54.8446,,,,25002716,,,,,,,49,1,0,47,0,2,4,0,0,0,0,0,0,0,0,33,https://www.altmetric.com/details/2493264,https://api.altmetric.com/v1/donut/2493264_240.png
374,Ejaculation frequency and subsequent risk of prostate cancer.,JAMA: Journal of the American Medical Association,,,Article,2004-04-07,10.1001/jama.291.13.1578,,,,15069045,,,,,,,33,9,0,151,0,0,7,2,1,0,1,0,0,0,2,49,https://www.altmetric.com/details/273460,https://api.altmetric.com/v1/donut/273460_240.png
353,Screening and prostate cancer mortality: results of the European Randomised Study of Screening for Prostate Cancer (ERSPC) at 13 years of follow-up ,The Lancet,,,Article,2014-08-05,10.1016/s0140-6736(14)60525-0,,,,25108889,,,,,,,24,11,0,219,0,1,10,0,0,0,0,0,0,0,0,117,https://www.altmetric.com/details/2577281,https://api.altmetric.com/v1/donut/2577281_240.png
352,Baseline Selenium Status and Effects of Selenium and Vitamin E Supplementation on Prostate Cancer Risk,JNCI: Journal of the National Cancer Institute,,,Article,2014-02-22,10.1093/jnci/djt456,,,,24563519,,,,,,,35,4,1,137,0,0,7,1,0,0,0,0,0,0,0,53,https://www.altmetric.com/details/2139986,https://api.altmetric.com/v1/donut/2139986_240.png
329,Selenium and Prostate Cancer: Analysis of Individual Participant Data From Fifteen Prospective Studies,JNCI: Journal of the National Cancer Institute,,,Article,2016-11-01,10.1093/jnci/djw153,,,,27385803,,,,,,,50,0,0,12,0,0,2,0,0,0,0,0,0,0,0,3,https://www.altmetric.com/details/9285931,https://api.altmetric.com/v1/donut/9285931_240.png
314,Long-term survival of participants in the prostate cancer prevention trial.,New England Journal of Medicine,,,Article,2013-08-15,10.1056/nejmoa1215932,,,,23944298,,,,,,,30,6,0,67,0,0,6,0,0,0,0,0,2,0,0,29,https://www.altmetric.com/details/1689776,https://api.altmetric.com/v1/donut/1689776_240.png
308,Integrative Clinical Genomics of Advanced Prostate Cancer.,Cell,,,Article,2015-05-23,10.1016/j.cell.2015.05.001,,,,26000489,,,,,,,25,7,0,110,8,0,4,0,2,0,0,0,1,0,0,342,https://www.altmetric.com/details/4036975,https://api.altmetric.com/v1/donut/4036975_240.png
304,Vasectomy and Prostate Cancer Incidence and Mortality in a Large US Cohort,Journal of Clinical Oncology,,,Article,2016-09-21,10.1200/jco.2015.66.2361,,,,27646949,,,,,,,35,2,0,57,0,0,2,0,1,0,0,0,0,0,0,0,https://www.altmetric.com/details/12090725,https://api.altmetric.com/v1/donut/12090725_240.png
291,Prostate Cancer Incidence Rates 2 Years After the US Preventive Services Task Force Recommendations Against Screening,JAMA Oncology,,,Article,2016-08-18,10.1001/jamaoncol.2016.2667,,,,27541955,,,,,,,39,0,0,191,0,0,1,0,0,0,0,0,0,0,0,6,https://www.altmetric.com/details/10683413,https://api.altmetric.com/v1/donut/10683413_240.png
284,mtDNA mutations increase tumorigenicity in prostate cancer,Proceedings of the National Academy of Sciences of the United States of America,,,Article,2005-01-18,10.1073/pnas.0408894102,,,,15647368,,,,,,,34,2,0,0,0,0,0,0,0,0,0,0,0,0,0,142,https://www.altmetric.com/details/6120668,https://api.altmetric.com/v1/donut/6120668_240.png
273,"Prostate metastatic bone cancer in an Egyptian Ptolemaic mummy, a proposed radiological diagnosis ",International Journal of Paleopathology,,,Article,2011-10-02,10.1016/j.ijpp.2011.09.002,,,,,,,,,,,35,1,0,8,0,0,4,0,1,0,0,0,0,0,0,33,https://www.altmetric.com/details/433365,https://api.altmetric.com/v1/donut/433365_240.png
262,"Vegetarianism, low meat consumption and the risk of lung, postmenopausal breast and prostate cancer in a population-based cohort study",European Journal of Clinical Nutrition,,,Article,2016-03-02,10.1038/ejcn.2016.25,,,,26931668,,,,,,,1,0,0,341,0,0,11,0,0,0,0,0,0,0,0,3,https://www.altmetric.com/details/6039505,https://api.altmetric.com/v1/donut/6039505_240.png
257,Uptake of Active Surveillance for Very-Low-Risk Prostate Cancer in Sweden,JAMA Oncology,,,Article,2016-10-20,10.1001/jamaoncol.2016.3600,,,,27768168,,,,,,,38,1,0,58,0,0,0,0,0,0,0,0,0,0,0,2,https://www.altmetric.com/details/12859304,https://api.altmetric.com/v1/donut/12859304_240.png
255,"Snus use, smoking and survival among prostate cancer patients",International Journal of Cancer,,,Article,2016-10-12,10.1002/ijc.30411,,,,27582277,,,,,,,41,1,0,17,2,0,3,0,0,0,0,0,0,0,0,0,https://www.altmetric.com/details/12584521,https://api.altmetric.com/v1/donut/12584521_240.png
248,Final Results of a Phase I/II Multicenter Trial of WST11 (TOOKAD� Soluble) Vascular-Targeted Photodynamic Therapy (VTP) for Hemiablation of the Prostate in Men with Unilateral Low Risk Prostate Cancer Conducted in the United States,The Journal of Urology,,,Article,2016-06-09,10.1016/j.juro.2016.05.113,,,,27291652,,,,,,,37,0,0,10,0,0,2,0,0,0,0,0,0,0,0,8,https://www.altmetric.com/details/8621749,https://api.altmetric.com/v1/donut/8621749_240.png
246,Chemohormonal Therapy in Metastatic Hormone-Sensitive Prostate Cancer.,New England Journal of Medicine,,,Article,2015-08-06,10.1056/nejmoa1503747,,,,26244877,,,,,,,16,2,0,243,0,0,13,0,0,0,0,0,1,0,0,212,https://www.altmetric.com/details/4368820,https://api.altmetric.com/v1/donut/4368820_240.png
242,"Family History and Probability of Prostate Cancer, Differentiated by Risk Category: A Nationwide Population-Based Study",JNCI: Journal of the National Cancer Institute,,,Article,2016-10-01,10.1093/jnci/djw110,,,,27400876,,,,,,,34,0,0,14,0,0,1,0,1,0,2,0,0,0,0,1,https://www.altmetric.com/details/9577877,https://api.altmetric.com/v1/donut/9577877_240.png
241,Incidence of complications other than urinary incontinence or erectile dysfunction after radical prostatectomy or radiotherapy for prostate cancer: a population-based cohort study,Lancet Oncology,,,Article,2015-07-22,10.1016/s1470-2045(13)70606-5,,,,24440474,,,,,,,15,3,0,169,0,0,6,0,1,0,0,0,0,0,0,58,https://www.altmetric.com/details/2049691,https://api.altmetric.com/v1/donut/2049691_240.png
240,"Annual Report to the Nation on the status of cancer, 1975?2010, featuring prevalence of comorbidity and impact on survival among persons with lung, colorectal, breast, or prostate cancer",Cancer (0008543X),,,Article,2013-01-01,10.1002/cncr.28509,,,,24343171,,,,,,,28,5,0,81,0,0,16,0,1,0,0,0,0,0,0,195,https://www.altmetric.com/details/1983605,https://api.altmetric.com/v1/donut/1983605_240.png
239,Implementation of a Machine Learning�Based Automatic Contour Quality Assurance Tool for Online Adaptive Radiation Therapy of Prostate Cancer,"International Journal of Radiation Oncology, Biology, Physics",,,Article,2016-10-01,10.1016/j.ijrobp.2016.06.2300,,,,27675310,,,,,,,33,0,0,0,0,0,0,0,0,0,0,0,0,0,0,0,https://www.altmetric.com/details/12577712,https://api.altmetric.com/v1/donut/12577712_240.png
233,Serial MRI in Active Surveillance of Prostate Cancer: Incremental Value ,The Journal of Urology,,,Article,2015-12-18,10.1016/j.juro.2015.11.055,,,,26674305,,,,,,,35,0,0,9,0,0,1,0,0,0,0,0,0,0,0,5,https://www.altmetric.com/details/4849878,https://api.altmetric.com/v1/donut/4849878_240.png
232,The relationship between intolerance of uncertainty and anxiety in men on active surveillance for prostate cancer,The Journal of Urology,,,Article,2016-02-09,10.1016/j.juro.2016.01.108,,,,26872841,,,,,,,35,0,0,8,0,0,1,0,0,0,0,0,0,0,0,11,https://www.altmetric.com/details/5172754,https://api.altmetric.com/v1/donut/5172754_240.png
232,Screening for Prostate Cancer: A Guidance Statement From the Clinical Guidelines Committee of the American College of Physicians,Annals of Internal Medicine,,,Article,2013-01-01,10.7326/0003-4819-158-10-201305210-00633,,,,23567643,,,,,,,14,5,0,166,0,0,5,1,0,0,0,0,0,0,0,76,https://www.altmetric.com/details/1353241,https://api.altmetric.com/v1/donut/1353241_240.png
230,Baseline Prostate-Specific Antigen Levels in Midlife Predict Lethal Prostate Cancer,Journal of Clinical Oncology,,,Article,2016-06-13,10.1200/jco.2016.66.7527,,,,27298404,,,,,,,21,2,0,129,0,0,4,0,0,0,0,0,1,0,0,17,https://www.altmetric.com/details/8713973,https://api.altmetric.com/v1/donut/8713973_240.png
229,"A double-blind, placebo-controlled randomised trial evaluating the effect of a polyphenol-rich whole food supplement on PSA progression in men with prostate cancer|[mdash]|the UK NCRN Pomi-T study",Prostate Cancer & Prostatic Diseases,,,Article,2014-03-11,10.1038/pcan.2014.6,,,,24614693,,,,,,,3,0,0,292,0,0,13,0,0,0,0,0,0,0,0,69,https://www.altmetric.com/details/2186096,https://api.altmetric.com/v1/donut/2186096_240.png
228,Urologists' use of intensity-modulated radiation therapy for prostate cancer.,New England Journal of Medicine,,,Article,2013-10-24,10.1056/nejmsa1201141,,,,24152262,,,,,,,29,6,0,75,0,0,1,0,1,0,0,0,1,0,0,30,https://www.altmetric.com/details/1854451,https://api.altmetric.com/v1/donut/1854451_240.png
228,The evolutionary history of lethal metastatic prostate cancer,Nature,,,Article,2015-04-01,10.1038/nature14347,,,,25830880,,,,,,,11,8,0,176,0,0,9,0,2,0,0,0,1,0,0,403,https://www.altmetric.com/details/3860330,https://api.altmetric.com/v1/donut/3860330_240.png
226,Long-Term Functional Outcomes after Treatment for Localized Prostate Cancer,New England Journal of Medicine,,,Article,2013-01-31,10.1056/nejmoa1209978,,,,23363497,,,,,,,14,4,0,113,0,0,8,1,2,0,0,0,1,0,0,116,https://www.altmetric.com/details/1208871,https://api.altmetric.com/v1/donut/1208871_240.png
225,Prevalence of Nonrecommended Screening for Prostate Cancer and Breast Cancer in the United States: A Nationwide Survey Analysis,JAMA Oncology,,,Article,2016-01-21,10.1001/jamaoncol.2015.5871,,,,26794060,,,,,,,24,0,0,164,0,0,8,0,0,0,0,0,0,0,0,5,https://www.altmetric.com/details/5022664,https://api.altmetric.com/v1/donut/5022664_240.png
221,"Conventional versus hypofractionated high-dose intensity-modulated radiotherapy for prostate cancer: 5-year outcomes of the randomised, non-inferiority, phase 3 CHHiP trial ",Lancet Oncology,,,Article,2016-06-20,10.1016/s1470-2045(16)30102-4,,,,27339115,PMC4961874,,,,,,21,1,0,164,0,0,2,0,0,0,0,0,0,0,0,53,https://www.altmetric.com/details/8941057,https://api.altmetric.com/v1/donut/8941057_240.png
219,"Relationship Between Male Pattern Baldness and the Risk of Aggressive Prostate Cancer: An Analysis of the Prostate, Lung, Colorectal, and Ovarian Cancer Screening Trial.",Journal of Clinical Oncology,,,Article,2014-09-14,10.1200/jco.2014.55.4279,,,,25225425,,,,,,,16,1,0,116,0,0,7,0,3,0,2,0,0,0,1,27,https://www.altmetric.com/details/2686085,https://api.altmetric.com/v1/donut/2686085_240.png
219,A role for finasteride in the prevention of prostate cancer?,New England Journal of Medicine,,,Article,2013-08-15,10.1056/nejme1307059,,,,23944306,,,,,,,24,2,0,13,0,0,0,0,0,0,0,0,0,0,0,10,https://www.altmetric.com/details/1689909,https://api.altmetric.com/v1/donut/1689909_240.png
218,Benefits of whole ginger extract in prostate cancer.,British Journal of Nutrition,,,Article,1970-01-01,10.1017/s0007114511003308,,,,21849094,,,,,,,2,6,0,98,0,0,70,0,107,0,0,0,0,0,0,59,https://www.altmetric.com/details/240586,https://api.altmetric.com/v1/donut/240586_240.png
216,Effect of Acute Exercise on Prostate Cancer Cell Growth,PLoS ONE,,,Article,2013-07-05,10.1371/journal.pone.0067579,,,,23861774,,,,,,,0,1,0,274,0,0,35,0,10,0,5,0,0,0,0,47,https://www.altmetric.com/details/1610037,https://api.altmetric.com/v1/donut/1610037_240.png
208,Radical prostatectomy or watchful waiting in early prostate cancer.,New England Journal of Medicine,,,Article,2014-03-06,10.1056/nejmoa1311593,,,,24597866,,,,,,,19,6,0,93,0,0,4,0,8,0,0,0,2,0,0,22,https://www.altmetric.com/details/2170875,https://api.altmetric.com/v1/donut/2170875_240.png
200,Treatment-induced damage to the tumor microenvironment promotes prostate cancer therapy resistance through WNT16B,Nature Medicine,,,Article,2012-08-05,10.1038/nm.2890,,,,22863786,,,,,,,1,7,0,146,0,0,148,1,1,0,0,1,4,1,0,257,https://www.altmetric.com/details/873851,https://api.altmetric.com/v1/donut/873851_240.png
198,Vitamin d deficiency predicts prostate biopsy outcomes.,Clinical Cancer Research,,,Article,2014-05-01,10.1158/1078-0432.ccr-13-3085,,,,24789033,,,,,,,23,5,0,28,0,0,8,0,0,0,0,0,0,0,1,23,https://www.altmetric.com/details/2318433,https://api.altmetric.com/v1/donut/2318433_240.png
198,"An Observational Study of Erectile Dysfunction, Infertility, and Prostate Cancer in Regular Cyclists: Cycling for Health UK Study",Journal of Men's Health,,,Article,2014-06-01,10.1089/jomh.2014.0012,,,,,,,,,,,21,1,0,52,0,4,5,1,0,0,2,0,0,0,1,12,https://www.altmetric.com/details/2440494,https://api.altmetric.com/v1/donut/2440494_240.png
197,Impact of Radiation Therapy Dose Escalation on Prostate Cancer Outcomes and Toxicities,American Journal of Clinical Oncology: Cancer Clinical Trials,,,Article,2016-03-24,10.1097/coc.0000000000000285,,,http://journals.lww.com/amjclinicaloncology/Fulltext/publishahead/Impact_of_Radiation_Therapy_Dose_Escalation_on.99059.aspx,27014930,,,,,,,29,2,0,15,0,0,1,0,0,0,0,0,0,0,0,0,https://www.altmetric.com/details/6346893,https://api.altmetric.com/v1/donut/6346893_240.png
194,Active Surveillance for Low-Risk Prostate Cancer�An Evolving International Standard of Care,JAMA Oncology,,,Article,2016-10-20,10.1001/jamaoncol.2016.3179,,,,27768167,,,,,,,31,1,0,33,0,0,0,0,0,0,0,0,0,0,0,0,https://www.altmetric.com/details/12859305,https://api.altmetric.com/v1/donut/12859305_240.png
193,Prostate-cancer mortality at 11 years of follow-up.,New England Journal of Medicine,,,Article,2012-03-15,10.1056/nejmoa1113135,,,,22417251,,,,,,,10,12,1,118,0,0,11,0,3,0,0,0,0,0,0,235,https://www.altmetric.com/details/649295,https://api.altmetric.com/v1/donut/649295_240.png
191,Enzalutamide in Metastatic Prostate Cancer before Chemotherapy.,New England Journal of Medicine,,,Article,2014-06-01,10.1056/nejmoa1405095,,,,24881730,,,,,,,19,2,0,98,0,1,8,2,0,0,0,0,1,0,0,182,https://www.altmetric.com/details/2398809,https://api.altmetric.com/v1/donut/2398809_240.png
190,Coffee Consumption and Prostate Cancer Risk and Progression in the Health Professionals Follow-up Study,JNCI: Journal of the National Cancer Institute,,,Article,2011-05-17,10.1093/jnci/djr151,,,,21586702,PMC3110172,,,,,,10,6,0,122,0,0,21,0,1,0,0,0,0,0,0,55,https://www.altmetric.com/details/101710,https://api.altmetric.com/v1/donut/101710_240.png
185,Combining radiotherapy and immunotherapy for prostate cancer: two decades of research from preclinical to clinical trials,Journal of Radiation Oncology,,,Article,2015-12-09,10.1007/s13566-015-0240-5,,,,,,,,,,,32,0,0,1,0,0,1,0,0,0,0,0,0,0,0,5,https://www.altmetric.com/details/4870367,https://api.altmetric.com/v1/donut/4870367_240.png
182,Population-based assessment of determining predictors for quality of prostate cancer surveillance.,Cancer (0008543X),,,Article,2015-12-01,10.1002/cncr.29574,,,,26307939,,,,,,,24,1,0,10,0,0,0,0,0,0,0,0,0,0,0,13,https://www.altmetric.com/details/4459500,https://api.altmetric.com/v1/donut/4459500_240.png
181,Prospective Quality of Life in Men Choosing Active Surveillance Compared to Those Biopsied but not Diagnosed with Prostate Cancer,The Journal of Urology,,,Article,2016-03-11,10.1016/j.juro.2016.02.2972,,,,26976206,,,,,,,43,1,0,17,0,0,1,0,0,0,0,0,0,0,0,3,https://www.altmetric.com/details/6174219,https://api.altmetric.com/v1/donut/6174219_240.png
180,Prostate Cancer Incidence and PSA Testing Patterns in Relation to USPSTF Screening Recommendations,JAMA: Journal of the American Medical Association,,,Article,2015-11-17,10.1001/jama.2015.14905,,,,26575061,,,,,,,8,4,0,166,0,0,4,0,0,0,0,0,1,0,0,61,https://www.altmetric.com/details/4773469,https://api.altmetric.com/v1/donut/4773469_240.png
178,Second-Generation HSP90 Inhibitor Onalespib Blocks mRNA Splicing of Androgen Receptor Variant 7 in Prostate Cancer Cells,Cancer Research,,,Article,2016-05-01,10.1158/0008-5472.can-15-2186,,,,27197266,PMC4874658,,,,,,24,1,0,6,0,0,1,0,0,0,0,0,0,0,0,14,https://www.altmetric.com/details/7130783,https://api.altmetric.com/v1/donut/7130783_240.png
176,Focal Laser Ablation of Prostate Cancer: Phase I Clinical Trial,The Journal of Urology,,,Article,2016-01-10,10.1016/j.juro.2015.12.083,,,,26748164,,,,,,,27,0,0,7,0,0,1,0,0,0,0,0,0,0,0,13,https://www.altmetric.com/details/4942470,https://api.altmetric.com/v1/donut/4942470_240.png